Reaction Details
TargetOxytocin receptor
LigandBDBM50384826
Substrate/Competitorn/a
Meas. Tech.ChEMBL_821172 (CHEMBL2039714)
Ki 39.81±n/a nM
Citation Borthwick, ADLiddle, JDavies, DEExall, AMHamlett, CHickey, DMMason, AMSmith, IENerozzi, FPeace, SPollard, DSollis, SLAllen, MJWoollard, PMPullen, MAWestfall, TDStanislaus, DJ Pyridyl-2,5-diketopiperazines as potent, selective, and orally bioavailable oxytocin antagonists: synthesis, pharmacokinetics, and in vivo potency. J Med Chem55:783-96 (2012) 
 
Oxytocin receptor
Name:Oxytocin receptor
Type:Enzyme Catalytic Domain
Mol. Mass.:42793.26
Organism:Homo sapiens (Human)
Description:Oxytocin OXTR HEK293::B2R9L7
Residue:389
BDBM50384826
NameBDBM50384826
Synonyms:CHEMBL2035015
TypeSmall organic molecule
Emp. Form.C34H39N3O3
Mol. Mass.537.6918
SMILESCC(C)C[C@H]1N([C@@H](C(=O)NC(C)C)c2ccccc2-c2ccccc2)C(=O)[C@H](NC1=O)C1Cc2ccccc2C1