Reaction Details
TargetOxytocin receptor
LigandBDBM50384830
Substrate/Competitorn/a
Meas. Tech.ChEMBL_821172 (CHEMBL2039714)
Ki 7.94±n/a nM
Citation Borthwick, ADLiddle, JDavies, DEExall, AMHamlett, CHickey, DMMason, AMSmith, IENerozzi, FPeace, SPollard, DSollis, SLAllen, MJWoollard, PMPullen, MAWestfall, TDStanislaus, DJ Pyridyl-2,5-diketopiperazines as potent, selective, and orally bioavailable oxytocin antagonists: synthesis, pharmacokinetics, and in vivo potency. J Med Chem55:783-96 (2012) 
 
Oxytocin receptor
Name:Oxytocin receptor
Type:Enzyme Catalytic Domain
Mol. Mass.:42793.26
Organism:Homo sapiens (Human)
Description:Oxytocin OXTR HEK293::B2R9L7
Residue:389
BDBM50384830
NameBDBM50384830
Synonyms:CHEMBL2035010
TypeSmall organic molecule
Emp. Form.C29H37N3O3
Mol. Mass.475.6224
SMILESCC(C)C[C@H]1N([C@@H](C(=O)NC(C)C)c2ccccc2C)C(=O)[C@H](NC1=O)C1Cc2ccccc2C1