Reaction Details
TargetBotulinum neurotoxin type A
LigandBDBM50384952
Substrate/Competitorn/a
Meas. Tech.ChEMBL_821371 (CHEMBL2040354)
Ki 889±n/a nM
Citation Opsenica, IFilipovic, VNuss, JEGomba, LMOpsenica, DBurnett, JCGussio, RSolaja, BABavari, S The synthesis of 2,5-bis(4-amidinophenyl)thiophene derivatives providing submicromolar-range inhibition of the botulinum neurotoxin serotype A metalloprotease. Eur J Med Chem53:374-9 (2012) 
 
Botulinum neurotoxin type A
Name:Botulinum neurotoxin type A
Type:PROTEIN
Mol. Mass.:149450.01
Organism:Clostridium botulinum
Description:ChEMBL_1510137
Residue:1296
BDBM50384952
NameBDBM50384952
Synonyms:CHEMBL2037388
TypeSmall organic molecule
Emp. Form.C46H48Cl2N6S
Mol. Mass.787.885
SMILESClc1ccc2c(NCCCCCNCc3ccc(cc3)-c3ccc(s3)-c3ccc(CNCCCCCNc4ccnc5cc(Cl)ccc45)cc3)ccnc2c1