Reaction Details
TargetThioredoxin reductase 1, cytoplasmic
LigandBDBM50385276
Substrate/Competitorn/a
Meas. Tech.ChEMBL_822563 (CHEMBL2039583)
IC50 2870±n/a nM
Citation He, JLi, DXiong, KGe, YJin, HZhang, GHong, MTian, YYin, JZeng, H Inhibition of thioredoxin reductase by a novel series of bis-1,2-benzisoselenazol-3(2H)-ones: Organoselenium compounds for cancer therapy. Bioorg Med Chem20:3816-27 (2012) 
 
Thioredoxin reductase 1, cytoplasmic
Name:Thioredoxin reductase 1, cytoplasmic
Type:PROTEIN
Mol. Mass.:54519.34
Organism:Rattus norvegicus
Description:ChEMBL_589950
Residue:498
BDBM50385276
NameBDBM50385276
Synonyms:CHEMBL2035487
TypeSmall organic molecule
Emp. Form.C16H10Cl2N2O2Se2
Mol. Mass.491.09
SMILESClc1ccc2c(c1)[se]n(CCn1[se]c3cc(Cl)ccc3c1=O)c2=O