Reaction Details
TargetThioredoxin reductase 1, cytoplasmic
LigandBDBM50385292
Substrate/Competitorn/a
Meas. Tech.ChEMBL_822563 (CHEMBL2039583)
IC50 1160±n/a nM
Citation He, JLi, DXiong, KGe, YJin, HZhang, GHong, MTian, YYin, JZeng, H Inhibition of thioredoxin reductase by a novel series of bis-1,2-benzisoselenazol-3(2H)-ones: Organoselenium compounds for cancer therapy. Bioorg Med Chem20:3816-27 (2012) 
 
Thioredoxin reductase 1, cytoplasmic
Name:Thioredoxin reductase 1, cytoplasmic
Type:PROTEIN
Mol. Mass.:54519.34
Organism:Rattus norvegicus
Description:ChEMBL_589950
Residue:498
BDBM50385292
NameBDBM50385292
Synonyms:CHEMBL2035471
TypeSmall organic molecule
Emp. Form.C19H18N2O2Se2
Mol. Mass.464.28
SMILESCc1ccc2[se]n(CCCn3[se]c4ccc(C)cc4c3=O)c(=O)c2c1