Reaction Details
TargetThioredoxin reductase 1, cytoplasmic
LigandBDBM50385303
Substrate/Competitorn/a
Meas. Tech.ChEMBL_822563 (CHEMBL2039583)
IC50 350±n/a nM
Citation He, JLi, DXiong, KGe, YJin, HZhang, GHong, MTian, YYin, JZeng, H Inhibition of thioredoxin reductase by a novel series of bis-1,2-benzisoselenazol-3(2H)-ones: Organoselenium compounds for cancer therapy. Bioorg Med Chem20:3816-27 (2012) 
 
Thioredoxin reductase 1, cytoplasmic
Name:Thioredoxin reductase 1, cytoplasmic
Type:PROTEIN
Mol. Mass.:54519.34
Organism:Rattus norvegicus
Description:ChEMBL_589950
Residue:498
BDBM50385303
NameBDBM50385303
Synonyms:CHEMBL2035460 | US8592468, EbSe14
TypeSmall organic molecule
Emp. Form.C16H12N2O2Se2
Mol. Mass.422.2
SMILESO=c1n(CCn2[se]c3ccccc3c2=O)[se]c2ccccc12