Reaction Details
TargetSerine/threonine-protein kinase B-raf
LigandBDBM25391
Substrate/Competitorn/a
Meas. Tech.ChEMBL_822607 (CHEMBL2039767)
Ki 0.16±n/a nM
Citation Li, CYLi, QSYan, LSun, XGWei, RGong, HBZhu, HL Synthesis, biological evaluation and 3D-QSAR studies of novel 4,5-dihydro-1H-pyrazole niacinamide derivatives as BRAF inhibitors. Bioorg Med Chem20:3746-55 (2012) 
 
Serine/threonine-protein kinase B-raf
Name:Serine/threonine-protein kinase B-raf
Type:Serine/threonine-protein kinase
Mol. Mass.:84446.00
Organism:Homo sapiens (Human)
Description:P15056
Residue:766
BDBM25391
NameBDBM25391
Synonyms:CHEMBL200622 SB590885 | [2-(4-{4-[(1E)-1-(hydroxyimino)-2,3-dihydro-1H-inden-5-yl]-5-(pyridin-4-yl)-1H-imidazol-2-yl}phenoxy)ethyl]dimethylamine
TypeSmall organic molecule
Emp. Form.C27H27N5O2
Mol. Mass.453.5356
SMILESCN(C)CCOc1ccc(cc1)-c1nc(c([nH]1)-c1ccc2C(CCc2c1)N=O)-c1ccncc1