Reaction Details
TargetDiacylglycerol O-acyltransferase 1
LigandBDBM50385401
Substrate/Competitorn/a
Meas. Tech.ChEMBL_822962 (CHEMBL2038283)
IC50 11000±n/a nM
Citation McCoull, WAddie, MSBirch, AMBirtles, SBuckett, LKButlin, RJBowker, SSBoyd, SChapman, SDavies, RDDonald, CSGreen, CPJenner, CKemmitt, PDLeach, AGMoody, GCGutierrez, PMNewcombe, NJNowak, TPacker, MJPlowright, ATRevill, JSchofield, PSheldon, CStokes, STurnbull, AVWang, SJWhalley, DPWood, JM Identification, optimisation and in vivo evaluation of oxadiazole DGAT-1 inhibitors for the treatment of obesity and diabetes. Bioorg Med Chem Lett22:3873-8 (2012) 
 
Diacylglycerol O-acyltransferase 1
Name:Diacylglycerol O-acyltransferase 1
Type:Protein
Mol. Mass.:55297.82
Organism:Homo sapiens (Human)
Description:O75907
Residue:488
BDBM50385401
NameBDBM50385401
Synonyms:CHEMBL2036572
TypeSmall organic molecule
Emp. Form.C18H17FN6O3
Mol. Mass.384.3644
SMILESFc1ccccc1Nc1nnc(o1)C(=O)Nc1ccc(cn1)N1CCOCC1