Reaction Details
TargetDiacylglycerol O-acyltransferase 1
LigandBDBM50385429
Substrate/Competitorn/a
Meas. Tech.ChEMBL_822962 (CHEMBL2038283)
IC50 5.7±n/a nM
Citation McCoull, WAddie, MSBirch, AMBirtles, SBuckett, LKButlin, RJBowker, SSBoyd, SChapman, SDavies, RDDonald, CSGreen, CPJenner, CKemmitt, PDLeach, AGMoody, GCGutierrez, PMNewcombe, NJNowak, TPacker, MJPlowright, ATRevill, JSchofield, PSheldon, CStokes, STurnbull, AVWang, SJWhalley, DPWood, JM Identification, optimisation and in vivo evaluation of oxadiazole DGAT-1 inhibitors for the treatment of obesity and diabetes. Bioorg Med Chem Lett22:3873-8 (2012) 
 
Diacylglycerol O-acyltransferase 1
Name:Diacylglycerol O-acyltransferase 1
Type:Protein
Mol. Mass.:55297.82
Organism:Homo sapiens (Human)
Description:O75907
Residue:488
BDBM50385429
NameBDBM50385429
Synonyms:CHEMBL2036734
TypeSmall organic molecule
Emp. Form.C24H22N6O3
Mol. Mass.442.4699
SMILESO=C(Nc1ccc(nc1)N1CCOCC1)c1nnc(Nc2cccc(c2)-c2ccccc2)o1