Reaction Details
TargetDual specificity protein kinase CLK1
LigandBDBM50385585
Substrate/Competitorn/a
Meas. Tech.ChEMBL_824956 (CHEMBL2045475)
IC50 130±n/a nM
Citation Deslandes, SLamoral-Theys, DFrongia, CChassaing, SBruyère, CLozach, OMeijer, LDucommun, BKiss, RDelfourne, E Synthesis and biological evaluation of analogs of the marine alkaloids granulatimide and isogranulatimide. Eur J Med Chem54:626-36 (2012) 
 
Dual specificity protein kinase CLK1
Name:Dual specificity protein kinase CLK1
Type:PROTEIN
Mol. Mass.:57124.52
Organism:Mus musculus
Description:ChEMBL_1502245
Residue:483
BDBM50385585
NameBDBM50385585
Synonyms:CHEMBL2041919
TypeSmall organic molecule
Emp. Form.C16H10N4O2
Mol. Mass.290.2762
SMILESCc1ccc2[nH]c3c4c[nH]nc4c4C(=O)NC(=O)c4c3c2c1