Reaction Details
TargetInsulin receptor
LigandBDBM50385590
Substrate/Competitorn/a
Meas. Tech.ChEMBL_825876 (CHEMBL2044753)
IC50 597±n/a nM
Citation Ott, GRTripathy, RCheng, MMcHugh, RAnzalone, AVUnderiner, TLCurry, MAQuail, MRLu, LWan, WAngeles, TSAlbom, MSAimone, LDAtor, MARuggeri, BADorsey, BD Discovery of a potent inhibitor of anaplastic lymphoma kinase with in vivo antitumor activity. ACS Med Chem Lett1:493-498 (2010) 
 
Insulin receptor
Name:Insulin receptor
Type:Receptor Tyrosine Kinase
Mol. Mass.:156322.60
Organism:Homo sapiens (Human)
Description:P06213
Residue:1382
BDBM50385590
NameBDBM50385590
Synonyms:CHEMBL2042829
TypeSmall organic molecule
Emp. Form.C25H29ClN6O3
Mol. Mass.496.989
SMILESCCN1c2ccc(Nc3ncc(Cl)c(N[C@@H]4[C@@H]5C[C@@H](C=C5)[C@@H]4C(N)=O)n3)c(OC)c2CCCC1=O