Reaction Details
TargetALK tyrosine kinase receptor
LigandBDBM50385590
Substrate/Competitorn/a
Meas. Tech.ChEMBL_823303 (CHEMBL2046142)
IC50 225±n/a nM
Citation Ott, GRTripathy, RCheng, MMcHugh, RAnzalone, AVUnderiner, TLCurry, MAQuail, MRLu, LWan, WAngeles, TSAlbom, MSAimone, LDAtor, MARuggeri, BADorsey, BD Discovery of a potent inhibitor of anaplastic lymphoma kinase with in vivo antitumor activity. ACS Med Chem Lett1:493-498 (2010) 
 
ALK tyrosine kinase receptor
Name:ALK tyrosine kinase receptor
Type:Protein
Mol. Mass.:176453.10
Organism:Homo sapiens (Human)
Description:Q9UM73
Residue:1620
BDBM50385590
NameBDBM50385590
Synonyms:CHEMBL2042829
TypeSmall organic molecule
Emp. Form.C25H29ClN6O3
Mol. Mass.496.989
SMILESCCN1c2ccc(Nc3ncc(Cl)c(N[C@@H]4[C@@H]5C[C@@H](C=C5)[C@@H]4C(N)=O)n3)c(OC)c2CCCC1=O