Reaction Details
TargetProstaglandin D2 receptor 2
LigandBDBM50385618
Substrate/Competitorn/a
Meas. Tech.ChEMBL_825949 (CHEMBL2044973)
Ki 28±n/a nM
Citation Crosignani, SJorand-Lebrun, CPage, PCampbell, GColovray, VMissotten, MHumbert, YCleva, CArrighi, JFGaudet, MJohnson, ZFerro, PChollet, A Optimization of the Central Core of Indolinone-Acetic Acid-Based CRTH2 (DP2) Receptor Antagonists. ACS Med Chem Lett2:644-649 (2011) 
 
Prostaglandin D2 receptor 2
Name:Prostaglandin D2 receptor 2
Type:Enzyme
Mol. Mass.:43295.45
Organism:Homo sapiens (Human)
Description:Q9Y5Y4
Residue:395
BDBM50385618
NameBDBM50385618
Synonyms:CHEMBL2042236
TypeSmall organic molecule
Emp. Form.C19H12Cl2FN3O5
Mol. Mass.452.22
SMILESOC(=O)CN1C(=O)C2(NC(=O)N(Cc3cc(Cl)ccc3F)C2=O)c2cc(Cl)ccc12