Reaction Details
TargetSmoothened homolog
LigandBDBM50385641
Substrate/Competitorn/a
Meas. Tech.ChEMBL_825977 (CHEMBL2045142)
IC50 35±n/a nM
Citation Munchhof, MJLi, QShavnya, ABorzillo, GVBoyden, TLJones, CSLaGreca, SDMartinez-Alsina, LPatel, NPelletier, KReiter, LARobbins, MDTkalcevic, GT Discovery of PF-04449913, a Potent and Orally Bioavailable Inhibitor of Smoothened. ACS Med Chem Lett3:106-111 (2012) 
 
Smoothened homolog
Name:Smoothened homolog
Type:PROTEIN
Mol. Mass.:87472.73
Organism:Mus musculus
Description:ChEMBL_1510377
Residue:793
BDBM50385641
NameBDBM50385641
Synonyms:CHEMBL2043434
TypeSmall organic molecule
Emp. Form.C21H25N5O2
Mol. Mass.379.4555
SMILESCOc1ccc(NC(=O)N[C@@H]2CCN(C)[C@H](C2)c2nc3ccccc3[nH]2)cc1