Reaction Details
TargetGlycogen phosphorylase, muscle form
LigandBDBM50386289
Substrate/Competitorn/a
Meas. Tech.ChEMBL_824549 (CHEMBL2045432)
Ki 3270±n/a nM
Citation Kantsadi, ALManta, SPsarra, AMDimopoulou, AKiritsis, CParmenopoulou, VSkamnaki, VTZoumpoulakis, PZographos, SELeonidas, DDKomiotis, D The binding of C5-alkynyl and alkylfurano[2,3-d]pyrimidine glucopyranonucleosides to glycogen phosphorylase b: synthesis, biochemical and biological assessment. Eur J Med Chem54:740-9 (2012) 
 
Glycogen phosphorylase, muscle form
Name:Glycogen phosphorylase, muscle form
Type:PROTEIN
Mol. Mass.:97097.45
Organism:Homo sapiens (Human)
Description:ChEMBL_1449751
Residue:842
BDBM50386289
NameBDBM50386289
Synonyms:CHEMBL2041082
TypeSmall organic molecule
Emp. Form.C10H13BrN2O7
Mol. Mass.353.123
SMILESOC[C@H]1O[C@H]([C@H](O)[C@@H](O)[C@@H]1O)n1cc(Br)c(=O)[nH]c1=O