Reaction Details
TargetPotassium voltage-gated channel subfamily KQT member 2/3
LigandBDBM50420042
Substrate/Competitorn/a
Meas. Tech.ChEMBL_826558 (CHEMBL2050726)
EC50 4800±n/a nM
Citation Amato, GRoeloffs, RRigdon, GCAntonio, BMersch, TMcNaughton-Smith, GWickenden, ADFritch, PSuto, MJ N-Pyridyl and Pyrimidine Benzamides as KCNQ2/Q3 Potassium Channel Openers for the Treatment of Epilepsy. ACS Med Chem Lett2:481-484 (2011) 
 
Potassium voltage-gated channel subfamily KQT member 2/3
Name:Potassium voltage-gated channel subfamily KQT member 2/3
Type:n/a
Mol. Mass.:n/a
Description:ASSAY_ID of EBI is 91707
Components:This complex has 3 components.
Component 1
Name:Potassium voltage-gated channel subfamily KQT member 2
Synonyms:KCNQ (Kv7) potassium channel KCNQ2_HUMAN Neuroblastoma-specific potassium channel subunit alpha KvLQT2 Voltage-gated potassium channel subunit Kv7.2
Type:PROTEIN
Mol. Mass.:95883.20
Organism:Homo sapiens (Human)
Description:ChEMBL_1457496
Residue:872
Component 2
Name:Potassium voltage-gated channel subfamily KQT member 3
Synonyms:KCNQ (Kv7) potassium channel KCNQ3_HUMAN | Voltage-gated potassium channel subunit Kv7.3
Type:PROTEIN
Mol. Mass.:96759.41
Organism:Homo sapiens (Human)
Description:ChEMBL_938652
Residue:872
BDBM50420042
NameBDBM50420042
Synonyms:CHEMBL2046474
TypeSmall organic molecule
Emp. Form.C12H7F3N2O
Mol. Mass.252.192
SMILESFc1ccc(NC(=O)c2ccc(F)c(F)c2)cn1