Reaction Details
TargetPotassium voltage-gated channel subfamily E/KQT member 1
LigandBDBM50420080
Substrate/Competitorn/a
Meas. Tech.ChEMBL_826559 (CHEMBL2050727)
IC50>100000±n/a nM
Citation Amato, GRoeloffs, RRigdon, GCAntonio, BMersch, TMcNaughton-Smith, GWickenden, ADFritch, PSuto, MJ N-Pyridyl and Pyrimidine Benzamides as KCNQ2/Q3 Potassium Channel Openers for the Treatment of Epilepsy. ACS Med Chem Lett2:481-484 (2011) 
 
Potassium voltage-gated channel subfamily E/KQT member 1
Name:Potassium voltage-gated channel subfamily E/KQT member 1
Type:n/a
Mol. Mass.:n/a
Description:ASSAY_ID of EBI is 158552
Components:This complex has 2 components.
Component 1
Name:Potassium voltage-gated channel subfamily E member 1
Synonyms:Delayed rectifier potassium channel subunit IsK KCNE1 KCNQ1(Kv7.1)/KCNE1(MinK) Voltage-gated potassium channel beta subunit Mink | Voltage-gated potassium channel, IKs
Type:PROTEIN
Mol. Mass.:14676.11
Organism:Homo sapiens (Human)
Description:ChEMBL_1456351
Residue:129
Component 2
Name:Potassium voltage-gated channel subfamily KQT member 1
Synonyms:KCNA8 KCNQ (Kv7) potassium channel KCNQ1_HUMAN Voltage-gated potassium channel subunit Kv7.1 | Voltage-gated potassium channel subunit Kv7.1/Misshapen-like kinase 1
Type:PROTEIN
Mol. Mass.:74739.00
Organism:Homo sapiens (Human)
Description:ChEMBL_1454245
Residue:676
BDBM50420080
NameBDBM50420080
Synonyms:CHEMBL2047514
TypeSmall organic molecule
Emp. Form.C19H13ClF2N2OS
Mol. Mass.390.834
SMILESFc1ccc(CSc2ccc(cc2F)C(=O)Nc2ccc(Cl)nc2)cc1