Reaction Details
TargetHistone deacetylase 6
LigandBDBM50386444
Substrate/Competitorn/a
Meas. Tech.ChEMBL_827135 (CHEMBL2050419)
IC50 510±n/a nM
Citation Baud, MGLeiser, THaus, PSamlal, SWong, ACWood, RJPetrucci, VGunaratnam, MHughes, SMBuluwela, LTurlais, FNeidle, SMeyer-Almes, FJWhite, AJFuchter, MJ Defining the mechanism of action and enzymatic selectivity of psammaplin A against its epigenetic targets. J Med Chem55:1731-50 (2012) 
 
Histone deacetylase 6
Name:Histone deacetylase 6
Type:Chromatin regulator; hydrolase; repressor
Mol. Mass.:131381.51
Organism:Homo sapiens (Human)
Description:Q9UBN7
Residue:1215
BDBM50386444
NameBDBM50386444
Synonyms:CHEMBL2047696
TypeSmall organic molecule
Emp. Form.C13H17BrN2O4S
Mol. Mass.377.254
SMILESCOc1cc(CC(N=O)C(=O)NCCS)cc(Br)c1OC