Reaction Details
TargetHistone deacetylase 6
LigandBDBM50386448
Substrate/Competitorn/a
Meas. Tech.ChEMBL_827135 (CHEMBL2050419)
IC50 2300±n/a nM
Citation Baud, MGLeiser, THaus, PSamlal, SWong, ACWood, RJPetrucci, VGunaratnam, MHughes, SMBuluwela, LTurlais, FNeidle, SMeyer-Almes, FJWhite, AJFuchter, MJ Defining the mechanism of action and enzymatic selectivity of psammaplin A against its epigenetic targets. J Med Chem55:1731-50 (2012) 
 
Histone deacetylase 6
Name:Histone deacetylase 6
Type:Chromatin regulator; hydrolase; repressor
Mol. Mass.:131381.51
Organism:Homo sapiens (Human)
Description:Q9UBN7
Residue:1215
BDBM50386448
NameBDBM50386448
Synonyms:CHEMBL2047703
TypeSmall organic molecule
Emp. Form.C13H19N3O2S
Mol. Mass.281.374
SMILESCN(C)c1ccc(CC(N=O)C(=O)NCCS)cc1