Reaction Details
TargetHistone deacetylase 1
LigandBDBM50386459
Substrate/Competitorn/a
Meas. Tech.ChEMBL_827136 (CHEMBL2050420)
IC50>50000±n/a nM
Citation Baud, MGLeiser, THaus, PSamlal, SWong, ACWood, RJPetrucci, VGunaratnam, MHughes, SMBuluwela, LTurlais, FNeidle, SMeyer-Almes, FJWhite, AJFuchter, MJ Defining the mechanism of action and enzymatic selectivity of psammaplin A against its epigenetic targets. J Med Chem55:1731-50 (2012) 
 
Histone deacetylase 1
Name:Histone deacetylase 1
Type:Enzyme
Mol. Mass.:55090.27
Organism:Homo sapiens (Human)
Description:Q13547
Residue:482
BDBM50386459
NameBDBM50386459
Synonyms:CHEMBL2047543
TypeSmall organic molecule
Emp. Form.C14H19BrN2O3S
Mol. Mass.375.281
SMILESCO\N=C(/Cc1ccc(OC)c(Br)c1)C(=O)NCCSC