Reaction Details
TargetHistone deacetylase 6
LigandBDBM50386460
Substrate/Competitorn/a
Meas. Tech.ChEMBL_827135 (CHEMBL2050419)
IC50 9500±n/a nM
Citation Baud, MGLeiser, THaus, PSamlal, SWong, ACWood, RJPetrucci, VGunaratnam, MHughes, SMBuluwela, LTurlais, FNeidle, SMeyer-Almes, FJWhite, AJFuchter, MJ Defining the mechanism of action and enzymatic selectivity of psammaplin A against its epigenetic targets. J Med Chem55:1731-50 (2012) 
 
Histone deacetylase 6
Name:Histone deacetylase 6
Type:Chromatin regulator; hydrolase; repressor
Mol. Mass.:131381.51
Organism:Homo sapiens (Human)
Description:Q9UBN7
Residue:1215
BDBM50386460
NameBDBM50386460
Synonyms:CHEMBL2047544
TypeSmall organic molecule
Emp. Form.C24H28Br2N4O6S2
Mol. Mass.692.44
SMILESCO\N=C(/Cc1ccc(O)c(Br)c1)C(=O)NCCSSCCNC(=O)C(\Cc1ccc(O)c(Br)c1)=N\OC