Reaction Details
TargetHistone deacetylase 7
LigandBDBM50386452
Substrate/Competitorn/a
Meas. Tech.ChEMBL_827140 (CHEMBL2050424)
IC50 45000±n/a nM
Citation Baud, MGLeiser, THaus, PSamlal, SWong, ACWood, RJPetrucci, VGunaratnam, MHughes, SMBuluwela, LTurlais, FNeidle, SMeyer-Almes, FJWhite, AJFuchter, MJ Defining the mechanism of action and enzymatic selectivity of psammaplin A against its epigenetic targets. J Med Chem55:1731-50 (2012) 
 
Histone deacetylase 7
Name:Histone deacetylase 7
Type:Chromatin regulator; hydrolase; repressor
Mol. Mass.:102942.62
Organism:Homo sapiens (Human)
Description:Q8WUI4
Residue:952
BDBM50386452
NameBDBM50386452
Synonyms:CHEMBL2047680
TypeSmall organic molecule
Emp. Form.C11H14BrN3O2S
Mol. Mass.332.217
SMILESNN=C(Cc1ccc(O)c(Br)c1)C(=O)NCCS