Reaction Details
TargetHistone deacetylase 8
LigandBDBM50386450
Substrate/Competitorn/a
Meas. Tech.ChEMBL_827141 (CHEMBL2050425)
IC50 1500±n/a nM
Citation Baud, MGLeiser, THaus, PSamlal, SWong, ACWood, RJPetrucci, VGunaratnam, MHughes, SMBuluwela, LTurlais, FNeidle, SMeyer-Almes, FJWhite, AJFuchter, MJ Defining the mechanism of action and enzymatic selectivity of psammaplin A against its epigenetic targets. J Med Chem55:1731-50 (2012) 
 
Histone deacetylase 8
Name:Histone deacetylase 8
Type:Enzyme
Mol. Mass.:41749.60
Organism:Homo sapiens (Human)
Description:Q9BY41
Residue:377
BDBM50386450
NameBDBM50386450
Synonyms:CHEMBL2047684
TypeSmall organic molecule
Emp. Form.C12H14BrN3O5
Mol. Mass.360.161
SMILESONC(=O)CCNC(=O)C(Cc1ccc(O)c(Br)c1)N=O