Reaction Details
TargetHistone deacetylase 1
LigandBDBM50386661
Substrate/Competitorn/a
Meas. Tech.ChEMBL_826884 (CHEMBL2051699)
IC50 69.9±n/a nM
Citation Lai, MJHuang, HLPan, SLLiu, YMPeng, CYLee, HYYeh, TKHuang, PHTeng, CMChen, CSChuang, HYLiou, JP Synthesis and biological evaluation of 1-arylsulfonyl-5-(N-hydroxyacrylamide)indoles as potent histone deacetylase inhibitors with antitumor activity in vivo. J Med Chem55:3777-91 (2012) 
 
Histone deacetylase 1
Name:Histone deacetylase 1
Type:Enzyme
Mol. Mass.:55090.27
Organism:Homo sapiens (Human)
Description:Q13547
Residue:482
BDBM50386661
NameBDBM50386661
Synonyms:CHEMBL2048752
TypeSmall organic molecule
Emp. Form.C17H13N3O6S
Mol. Mass.387.367
SMILESONC(=O)\C=C\c1ccc2n(ccc2c1)S(=O)(=O)c1ccc(cc1)[N+]([O-])=O