Reaction Details
TargetHistone deacetylase 1
LigandBDBM50386662
Substrate/Competitorn/a
Meas. Tech.ChEMBL_826884 (CHEMBL2051699)
IC50 71.2±n/a nM
Citation Lai, MJHuang, HLPan, SLLiu, YMPeng, CYLee, HYYeh, TKHuang, PHTeng, CMChen, CSChuang, HYLiou, JP Synthesis and biological evaluation of 1-arylsulfonyl-5-(N-hydroxyacrylamide)indoles as potent histone deacetylase inhibitors with antitumor activity in vivo. J Med Chem55:3777-91 (2012) 
 
Histone deacetylase 1
Name:Histone deacetylase 1
Type:Enzyme
Mol. Mass.:55090.27
Organism:Homo sapiens (Human)
Description:Q13547
Residue:482
BDBM50386662
NameBDBM50386662
Synonyms:CHEMBL2048755
TypeSmall organic molecule
Emp. Form.C18H16N2O2
Mol. Mass.292.3318
SMILESONC(=O)\C=C\c1ccc2n(Cc3ccccc3)ccc2c1