Reaction Details
TargetHistone deacetylase 2
LigandBDBM50386657
Substrate/Competitorn/a
Meas. Tech.ChEMBL_826885 (CHEMBL2051700)
IC50 4±n/a nM
Citation Lai, MJHuang, HLPan, SLLiu, YMPeng, CYLee, HYYeh, TKHuang, PHTeng, CMChen, CSChuang, HYLiou, JP Synthesis and biological evaluation of 1-arylsulfonyl-5-(N-hydroxyacrylamide)indoles as potent histone deacetylase inhibitors with antitumor activity in vivo. J Med Chem55:3777-91 (2012) 
 
Histone deacetylase 2
Name:Histone deacetylase 2
Type:Chromatin regulator; hydrolase; repressor
Mol. Mass.:55356.54
Organism:Homo sapiens (Human)
Description:Q92769
Residue:488
BDBM50386657
NameBDBM50386657
Synonyms:CHEMBL2048746
TypeSmall organic molecule
Emp. Form.C17H14N2O4S
Mol. Mass.342.369
SMILESONC(=O)\C=C\c1ccc2n(ccc2c1)S(=O)(=O)c1ccccc1