Reaction Details
TargetHistone deacetylase 2
LigandBDBM50386658
Substrate/Competitorn/a
Meas. Tech.ChEMBL_826885 (CHEMBL2051700)
IC50 361.8±n/a nM
Citation Lai, MJHuang, HLPan, SLLiu, YMPeng, CYLee, HYYeh, TKHuang, PHTeng, CMChen, CSChuang, HYLiou, JP Synthesis and biological evaluation of 1-arylsulfonyl-5-(N-hydroxyacrylamide)indoles as potent histone deacetylase inhibitors with antitumor activity in vivo. J Med Chem55:3777-91 (2012) 
 
Histone deacetylase 2
Name:Histone deacetylase 2
Type:Chromatin regulator; hydrolase; repressor
Mol. Mass.:55356.54
Organism:Homo sapiens (Human)
Description:Q92769
Residue:488
BDBM50386658
NameBDBM50386658
Synonyms:CHEMBL2048749
TypeSmall organic molecule
Emp. Form.C18H16N2O5S
Mol. Mass.372.395
SMILESCOc1ccc(cc1)S(=O)(=O)n1ccc2cc(\C=C\C(=O)NO)ccc12