Reaction Details
TargetHistone deacetylase 6
LigandBDBM50386658
Substrate/Competitorn/a
Meas. Tech.ChEMBL_826886 (CHEMBL2051701)
IC50 3.3±n/a nM
Citation Lai, MJHuang, HLPan, SLLiu, YMPeng, CYLee, HYYeh, TKHuang, PHTeng, CMChen, CSChuang, HYLiou, JP Synthesis and biological evaluation of 1-arylsulfonyl-5-(N-hydroxyacrylamide)indoles as potent histone deacetylase inhibitors with antitumor activity in vivo. J Med Chem55:3777-91 (2012) 
 
Histone deacetylase 6
Name:Histone deacetylase 6
Type:Chromatin regulator; hydrolase; repressor
Mol. Mass.:131381.51
Organism:Homo sapiens (Human)
Description:Q9UBN7
Residue:1215
BDBM50386658
NameBDBM50386658
Synonyms:CHEMBL2048749
TypeSmall organic molecule
Emp. Form.C18H16N2O5S
Mol. Mass.372.395
SMILESCOc1ccc(cc1)S(=O)(=O)n1ccc2cc(\C=C\C(=O)NO)ccc12