Reaction Details
TargetBeta-secretase 1
LigandBDBM50387063
Substrate/Competitorn/a
Meas. Tech.ChEMBL_827643 (CHEMBL2050682)
IC50 400±n/a nM
Citation Sandgren, VAgback, TJohansson, POLindberg, JKvarnström, ISamuelsson, BBelda, ODahlgren, A Highly potent macrocyclic BACE-1 inhibitors incorporating a hydroxyethylamine core: design, synthesis and X-ray crystal structures of enzyme inhibitor complexes. Bioorg Med Chem20:4377-89 (2012) 
 
Beta-secretase 1
Name:Beta-secretase 1
Type:Protein
Mol. Mass.:55755.10
Organism:Homo sapiens (Human)
Description:P56817
Residue:501
BDBM50387063
NameBDBM50387063
Synonyms:CHEMBL2047040
TypeSmall organic molecule
Emp. Form.C35H44N4O6S
Mol. Mass.648.812
SMILESCC(C)c1cccc(CNC[C@@H](O)[C@@H]2COC\C=C\C[C@H](NC(=O)c3cc(cc(c3)C(=O)N2)N(C)S(C)(=O)=O)c2ccccc2)c1