Reaction Details
TargetCytochrome P450 1A2
LigandBDBM50387084
Substrate/Competitorn/a
Meas. Tech.ChEMBL_827666 (CHEMBL2050705)
IC50>100000±n/a nM
Citation Zhang, HZhou, LAmblard, FShi, JBobeck, DRTao, SMcBrayer, TRTharnish, PMWhitaker, TCoats, SJSchinazi, RF Synthesis and evaluation of novel potent HCV NS5A inhibitors. Bioorg Med Chem Lett22:4864-8 (2012) 
 
Cytochrome P450 1A2
Name:Cytochrome P450 1A2
Type:Enzyme
Mol. Mass.:58423.38
Organism:Homo sapiens (Human)
Description:P05177
Residue:516
BDBM50387084
NameBDBM50387084
Synonyms:BMS-790052 | DACLATASVIR
TypeSmall organic molecule
Emp. Form.C40H50N8O6
Mol. Mass.738.875
SMILESCOC(=O)N[C@@H](C(C)C)C(=O)N1CCC[C@H]1c1nc(c[nH]1)-c1ccc(cc1)-c1ccc(cc1)-c1c[nH]c(n1)[C@@H]1CCCN1C(=O)[C@@H](NC(=O)OC)C(C)C