Reaction Details
TargetCarbonic anhydrase 2
LigandBDBM50387120
Substrate/Competitorn/a
Meas. Tech.ChEMBL_827863 (CHEMBL2051272)
Ki 305±n/a nM
Citation Winum, JYCarta, FWard, CMullen, PHarrison, DLangdon, SPCecchi, AScozzafava, AKunkler, ISupuran, CT Ureido-substituted sulfamates show potent carbonic anhydrase IX inhibitory and antiproliferative activities against breast cancer cell lines. Bioorg Med Chem Lett22:4681-5 (2012) 
 
Carbonic anhydrase 2
Name:Carbonic anhydrase 2
Type:Enzyme
Mol. Mass.:29250.71
Organism:Homo sapiens (Human)
Description:P00918
Residue:260
BDBM50387120
NameBDBM50387120
Synonyms:4-ureidophenyl sulfamate ring derivative 3d | CHEMBL2047799
TypeSmall organic molecule
Emp. Form.C13H12BrN3O4S
Mol. Mass.386.221
SMILESNS(=O)(=O)Oc1ccc(NC(=O)Nc2ccc(Br)cc2)cc1