Reaction Details
TargetCarbonic anhydrase 12
LigandBDBM50387120
Substrate/Competitorn/a
Meas. Tech.ChEMBL_827865 (CHEMBL2051274)
Ki 8±n/a nM
Citation Winum, JYCarta, FWard, CMullen, PHarrison, DLangdon, SPCecchi, AScozzafava, AKunkler, ISupuran, CT Ureido-substituted sulfamates show potent carbonic anhydrase IX inhibitory and antiproliferative activities against breast cancer cell lines. Bioorg Med Chem Lett22:4681-5 (2012) 
 
Carbonic anhydrase 12
Name:Carbonic anhydrase 12
Type:Enzyme
Mol. Mass.:39456.00
Organism:Homo sapiens (Human)
Description:Catalytic domain of human cloned isozyme was used in the assay
Residue:354
BDBM50387120
NameBDBM50387120
Synonyms:4-ureidophenyl sulfamate ring derivative 3d | CHEMBL2047799
TypeSmall organic molecule
Emp. Form.C13H12BrN3O4S
Mol. Mass.386.221
SMILESNS(=O)(=O)Oc1ccc(NC(=O)Nc2ccc(Br)cc2)cc1