Reaction Details
TargetCarbonic anhydrase 2
LigandBDBM50387133
Substrate/Competitorn/a
Meas. Tech.ChEMBL_827863 (CHEMBL2051272)
Ki 298±n/a nM
Citation Winum, JYCarta, FWard, CMullen, PHarrison, DLangdon, SPCecchi, AScozzafava, AKunkler, ISupuran, CT Ureido-substituted sulfamates show potent carbonic anhydrase IX inhibitory and antiproliferative activities against breast cancer cell lines. Bioorg Med Chem Lett22:4681-5 (2012) 
 
Carbonic anhydrase 2
Name:Carbonic anhydrase 2
Type:Enzyme
Mol. Mass.:29250.71
Organism:Homo sapiens (Human)
Description:P00918
Residue:260
BDBM50387133
NameBDBM50387133
Synonyms:CHEMBL2047813
TypeSmall organic molecule
Emp. Form.C17H15N3O4S
Mol. Mass.357.384
SMILESNS(=O)(=O)Oc1ccc(NC(=O)Nc2cccc3ccccc23)cc1