Reaction Details
TargetCarbonic anhydrase 12
LigandBDBM50387137
Substrate/Competitorn/a
Meas. Tech.ChEMBL_827865 (CHEMBL2051274)
Ki 4±n/a nM
Citation Winum, JYCarta, FWard, CMullen, PHarrison, DLangdon, SPCecchi, AScozzafava, AKunkler, ISupuran, CT Ureido-substituted sulfamates show potent carbonic anhydrase IX inhibitory and antiproliferative activities against breast cancer cell lines. Bioorg Med Chem Lett22:4681-5 (2012) 
 
Carbonic anhydrase 12
Name:Carbonic anhydrase 12
Type:Enzyme
Mol. Mass.:39456.00
Organism:Homo sapiens (Human)
Description:Catalytic domain of human cloned isozyme was used in the assay
Residue:354
BDBM50387137
NameBDBM50387137
Synonyms:4-ureidophenyl sulfamate ring derivative 3v | CHEMBL2047817
TypeSmall organic molecule
Emp. Form.C13H11Cl2N3O4S
Mol. Mass.376.215
SMILESNS(=O)(=O)Oc1ccc(NC(=O)Nc2ccc(Cl)c(Cl)c2)cc1