Reaction Details
TargetCarbonic anhydrase 2
LigandBDBM50387144
Substrate/Competitorn/a
Meas. Tech.ChEMBL_827863 (CHEMBL2051272)
Ki 348±n/a nM
Citation Winum, JYCarta, FWard, CMullen, PHarrison, DLangdon, SPCecchi, AScozzafava, AKunkler, ISupuran, CT Ureido-substituted sulfamates show potent carbonic anhydrase IX inhibitory and antiproliferative activities against breast cancer cell lines. Bioorg Med Chem Lett22:4681-5 (2012) 
 
Carbonic anhydrase 2
Name:Carbonic anhydrase 2
Type:Enzyme
Mol. Mass.:29250.71
Organism:Homo sapiens (Human)
Description:P00918
Residue:260
BDBM50387144
NameBDBM50387144
Synonyms:CHEMBL2047824
TypeSmall organic molecule
Emp. Form.C15H15N3O5S
Mol. Mass.349.362
SMILESCC(=O)c1ccc(NC(=O)Nc2ccc(OS(N)(=O)=O)cc2)cc1