Reaction Details
TargetVascular endothelial growth factor receptor 2
LigandBDBM50387330
Substrate/Competitorn/a
Meas. Tech.ChEMBL_828122 (CHEMBL2049861)
Ki>4000±n/a nM
Citation Jimenez, JMDavis, CBoyall, DFraysse, DKnegtel, RSettimo, LYoung, SBolton, CChiu, PCurnock, ARasmussen, RTanner, AAger, I Structure-based optimization of aminopyridines as PKC¿ inhibitors. Bioorg Med Chem Lett22:4645-9 (2012) 
 
Vascular endothelial growth factor receptor 2
Name:Vascular endothelial growth factor receptor 2
Type:Receptor Tyrosine Kinase
Mol. Mass.:151510.97
Organism:Homo sapiens (Human)
Description:P35968
Residue:1356
BDBM50387330
NameBDBM50387330
Synonyms:CHEMBL2046643
TypeSmall organic molecule
Emp. Form.C20H24F3N5O
Mol. Mass.407.4327
SMILESCC(C)C[C@H]1CN(CCN1)c1ccc(c(n1)C(=O)c1cccnc1N)C(F)(F)F