Reaction Details
TargetProtein kinase C theta type
LigandBDBM50387340
Substrate/Competitorn/a
Meas. Tech.ChEMBL_828096 (CHEMBL2049835)
Ki 182±n/a nM
Citation Jimenez, JMDavis, CBoyall, DFraysse, DKnegtel, RSettimo, LYoung, SBolton, CChiu, PCurnock, ARasmussen, RTanner, AAger, I Structure-based optimization of aminopyridines as PKC¿ inhibitors. Bioorg Med Chem Lett22:4645-9 (2012) 
 
Protein kinase C theta type
Name:Protein kinase C theta type
Type:Serine/threonine-protein kinase
Mol. Mass.:81878.04
Organism:Homo sapiens (Human)
Description:Full-length human PKC theta (Panvera Catalog No. P2996).
Residue:706
BDBM50387340
NameBDBM50387340
Synonyms:CHEMBL2046634
TypeSmall organic molecule
Emp. Form.C16H19N5O
Mol. Mass.297.355
SMILESC[C@@H]1CN(CCN1)c1cccc(n1)C(=O)c1cccnc1N