Reaction Details
TargetProtein kinase C theta type
LigandBDBM50387349
Substrate/Competitorn/a
Meas. Tech.ChEMBL_828101 (CHEMBL2049840)
IC50 58±n/a nM
Citation Jimenez, JMDavis, CBoyall, DFraysse, DKnegtel, RSettimo, LYoung, SBolton, CChiu, PCurnock, ARasmussen, RTanner, AAger, I Structure-based optimization of aminopyridines as PKC¿ inhibitors. Bioorg Med Chem Lett22:4645-9 (2012) 
 
Protein kinase C theta type
Name:Protein kinase C theta type
Type:Serine/threonine-protein kinase
Mol. Mass.:81878.04
Organism:Homo sapiens (Human)
Description:Full-length human PKC theta (Panvera Catalog No. P2996).
Residue:706
BDBM50387349
NameBDBM50387349
Synonyms:CHEMBL2046644
TypeSmall organic molecule
Emp. Form.C19H24ClN5O
Mol. Mass.373.88
SMILESCC(C)C[C@H]1CN(CCN1)c1ccc(Cl)c(n1)C(=O)c1cccnc1N