Reaction Details
TargetProtein kinase C beta type
LigandBDBM50387330
Substrate/Competitorn/a
Meas. Tech.ChEMBL_828117 (CHEMBL2049856)
Ki 260±n/a nM
Citation Jimenez, JMDavis, CBoyall, DFraysse, DKnegtel, RSettimo, LYoung, SBolton, CChiu, PCurnock, ARasmussen, RTanner, AAger, I Structure-based optimization of aminopyridines as PKC¿ inhibitors. Bioorg Med Chem Lett22:4645-9 (2012) 
 
Protein kinase C beta type
Name:Protein kinase C beta type
Type:Enzyme
Mol. Mass.:76873.67
Organism:Homo sapiens (Human)
Description:The recombinant human PKC enzymes were produced using a baculovirus expression system in SF9 cells
Residue:671
BDBM50387330
NameBDBM50387330
Synonyms:CHEMBL2046643
TypeSmall organic molecule
Emp. Form.C20H24F3N5O
Mol. Mass.407.4327
SMILESCC(C)C[C@H]1CN(CCN1)c1ccc(c(n1)C(=O)c1cccnc1N)C(F)(F)F