Reaction Details
TargetHistamine H4 receptor
LigandBDBM50133018
Substrate/Competitorn/a
Meas. Tech.ChEMBL_828300 (CHEMBL2050319)
Ki 6.31±n/a nM
Citation Engelhardt, Hde Esch, IJKuhn, DSmits, RAZuiderveld, OPDobler, JMayer, MLips, SArnhof, HScharn, DHaaksma, EELeurs, R Detailed structure-activity relationship of indolecarboxamides as H4 receptor ligands. Eur J Med Chem54:660-8 (2012) 
 
Histamine H4 receptor
Name:Histamine H4 receptor
Type:G Protein-Coupled Receptor (GPCR)
Mol. Mass.:44517.02
Organism:Homo sapiens (Human)
Description:Binding assays were using CHO cells stably expressing hH4R receptors.
Residue:390
BDBM50133018
NameBDBM50133018
Synonyms:(4,5-Dichloro-1H-indol-2-yl)-(4-methyl-piperazin-1-yl)-methanone CHEMBL129436
TypeSmall organic molecule
Emp. Form.C14H15Cl2N3O
Mol. Mass.312.194
SMILESCN1CCN(CC1)C(=O)c1cc2c(Cl)c(Cl)ccc2[nH]1