Reaction Details
TargetProtein arginine N-methyltransferase 1 [11-371]
LigandBDBM50387483
Substrate/Competitorn/a
Meas. Tech.ChEMBL_828306 (CHEMBL2050325)
IC50 368300±n/a nM
Citation Sinha, SHOwens, EAFeng, YYang, YXie, YTu, YHenary, MZheng, YG Synthesis and evaluation of carbocyanine dyes as PRMT inhibitors and imaging agents. Eur J Med Chem54:647-59 (2012) 
 
Protein arginine N-methyltransferase 1 [11-371]
Name:Protein arginine N-methyltransferase 1 [11-371]
Type:Protein
Mol. Mass.:41506.52
Organism:Homo sapiens (Human)
Description:Q99873[11-371]
Residue:361
BDBM50387483
NameBDBM50387483
Synonyms:CHEMBL2047481
TypeSmall organic molecule
Emp. Form.C35H53N4
Mol. Mass.529.8205
SMILESCC1(C)\C(=C\C=C/C2=[N+](CCC[N+](C)(C)C)c3ccccc3C2(C)C)N(CCC[N+](C)(C)C)c2ccccc12