Reaction Details
TargetProtein arginine N-methyltransferase 1 [11-371]
LigandBDBM50387486
Substrate/Competitorn/a
Meas. Tech.ChEMBL_828306 (CHEMBL2050325)
IC50 18000±n/a nM
Citation Sinha, SHOwens, EAFeng, YYang, YXie, YTu, YHenary, MZheng, YG Synthesis and evaluation of carbocyanine dyes as PRMT inhibitors and imaging agents. Eur J Med Chem54:647-59 (2012) 
 
Protein arginine N-methyltransferase 1 [11-371]
Name:Protein arginine N-methyltransferase 1 [11-371]
Type:Protein
Mol. Mass.:41506.52
Organism:Homo sapiens (Human)
Description:Q99873[11-371]
Residue:361
BDBM50387486
NameBDBM50387486
Synonyms:CHEMBL2047486
TypeSmall organic molecule
Emp. Form.C39H45N2
Mol. Mass.541.7875
SMILESCCCCN1\C(=C/C=C\C2=[N+](CCCC)c3ccc4ccccc4c3C2(C)C)C(C)(C)c2c1ccc1ccccc21