Reaction Details
TargetHistone-arginine methyltransferase CARM1
LigandBDBM50387477
Substrate/Competitorn/a
Meas. Tech.ChEMBL_828321 (CHEMBL2050395)
IC50 100000±n/a nM
Citation Sinha, SHOwens, EAFeng, YYang, YXie, YTu, YHenary, MZheng, YG Synthesis and evaluation of carbocyanine dyes as PRMT inhibitors and imaging agents. Eur J Med Chem54:647-59 (2012) 
 
Histone-arginine methyltransferase CARM1
Name:Histone-arginine methyltransferase CARM1
Type:Protein
Mol. Mass.:65855.47
Organism:Homo sapiens (Human)
Description:Q86X55
Residue:608
BDBM50387477
NameBDBM50387477
Synonyms:CHEMBL2047477
TypeSmall organic molecule
Emp. Form.C29H25N2
Mol. Mass.401.5217
SMILESCCn1c2cccc3cccc(c23)\c1=C\[CH+]\C=c1/n(CC)c2cccc3cccc1c23