Reaction Details
TargetNeuronal acetylcholine receptor subunit alpha-3/beta-4
LigandBDBM50257941
Substrate/Competitorn/a
Meas. Tech.ChEMBL_830457 (CHEMBL2061182)
EC50 55000±n/a nM
Citation Strachan, JPFarias, JJZhang, JCaldwell, WSBhatti, BS Diazaspirocyclic compounds as selective ligands for thea4ß2 nicotinic acetylcholine receptor. Bioorg Med Chem Lett22:5089-92 (2012) 
 
Neuronal acetylcholine receptor subunit alpha-3/beta-4
Name:Neuronal acetylcholine receptor subunit alpha-3/beta-4
Type:n/a
Mol. Mass.:n/a
Description:ASSAY_ID of ChEMBL is 1970247
Components:This complex has 2 components.
Component 1
Name:Neuronal acetylcholine receptor subunit beta-4
Synonyms:ACHB4_HUMAN Cholinergic, Nicotinic Alpha6Beta3Beta4Alpha5 Nicotinic acetylcholine receptor alpha6/alpha3/beta4
Type:Enzyme Catalytic Domain
Mol. Mass.:56388.51
Organism:Homo sapiens (Human)
Description:Cholinergic, Nicotinic Alpha6Beta3Beta4Alpha5 0 HUMAN::P30926
Residue:498
Component 2
Name:Neuronal acetylcholine receptor subunit alpha-3
Synonyms:ACHA3_HUMAN Cholinergic, Nicotinic Alpha3Beta2 Cholinergic, Nicotinic Alpha3Beta4x NACHRA3 Neuronal acetylcholine receptor subunit alpha-3 nicotinic central
Type:Enzyme Catalytic Domain
Mol. Mass.:57479.03
Organism:Homo sapiens (Human)
Description:Cholinergic, Nicotinic Alpha3Beta2 0 HUMAN::P32297
Residue:505
BDBM50257941
NameBDBM50257941
Synonyms:7-(pyridin-3-yl)-1,7-diazaspiro[4.4]nonane | CHEMBL504652
TypeSmall organic molecule
Emp. Form.C12H17N3
Mol. Mass.203.2835
SMILESC1CNC2(C1)CCN(C2)c1cccnc1