Reaction Details
TargetLong-chain fatty acid transport protein 1
LigandBDBM50387670
Substrate/Competitorn/a
Meas. Tech.ChEMBL_830658 (CHEMBL2061593)
IC50>1000±n/a nM
Citation Matsufuji, TIkeda, MNaito, AHirouchi, MTakakusa, HKanda, SIzumi, MHarada, JShinozuka, T Discovery and optimization of novel fatty acid transport protein 1 (FATP1) inhibitors. Bioorg Med Chem Lett22:5067-70 (2012) 
 
Long-chain fatty acid transport protein 1
Name:Long-chain fatty acid transport protein 1
Type:PROTEIN
Mol. Mass.:71123.97
Organism:Homo sapiens (Human)
Description:ChEMBL_956920
Residue:646
BDBM50387670
NameBDBM50387670
Synonyms:CHEMBL2058085
TypeSmall organic molecule
Emp. Form.C19H20ClN5OS
Mol. Mass.401.913
SMILESCCn1c(CNc2ccccc2)nnc1SCC(=O)Nc1ccc(Cl)cc1