Reaction Details
TargetHistone deacetylase 1
LigandBDBM50387968
Substrate/Competitorn/a
Meas. Tech.ChEMBL_829144 (CHEMBL2059966)
IC50 5600±n/a nM
Citation Vaidya, ASKarumudi, BMendonca, EMadriaga, AAbdelkarim, Hvan Breemen, RBPetukhov, PA Design, synthesis, modeling, biological evaluation and photoaffinity labeling studies of novel series of photoreactive benzamide probes for histone deacetylase 2. Bioorg Med Chem Lett22:5025-30 (2012) 
 
Histone deacetylase 1
Name:Histone deacetylase 1
Type:Enzyme
Mol. Mass.:55090.27
Organism:Homo sapiens (Human)
Description:Q13547
Residue:482
BDBM50387968
NameBDBM50387968
Synonyms:CHEMBL2057825
TypeSmall organic molecule
Emp. Form.C18H14N8OS
Mol. Mass.390.422
SMILESNc1ccc(cc1NC(=O)c1cc(CN=[N+]=[N-])cc(c1)N=[N+]=[N-])-c1cccs1