Reaction Details
TargetHistone deacetylase 2
LigandBDBM50387971
Substrate/Competitorn/a
Meas. Tech.ChEMBL_829146 (CHEMBL2059968)
IC50 17000±n/a nM
Citation Vaidya, ASKarumudi, BMendonca, EMadriaga, AAbdelkarim, Hvan Breemen, RBPetukhov, PA Design, synthesis, modeling, biological evaluation and photoaffinity labeling studies of novel series of photoreactive benzamide probes for histone deacetylase 2. Bioorg Med Chem Lett22:5025-30 (2012) 
 
Histone deacetylase 2
Name:Histone deacetylase 2
Type:Chromatin regulator; hydrolase; repressor
Mol. Mass.:55356.54
Organism:Homo sapiens (Human)
Description:Q92769
Residue:488
BDBM50387971
NameBDBM50387971
Synonyms:CHEMBL2057828
TypeSmall organic molecule
Emp. Form.C19H16N8O2S
Mol. Mass.420.448
SMILESNc1ccc(cc1NC(=O)c1ccc(OCCN=[N+]=[N-])c(c1)N=[N+]=[N-])-c1cccs1