Reaction Details
TargetHistone deacetylase 2
LigandBDBM50387970
Substrate/Competitorn/a
Meas. Tech.ChEMBL_829147 (CHEMBL2059969)
IC50 6500±n/a nM
Citation Vaidya, ASKarumudi, BMendonca, EMadriaga, AAbdelkarim, Hvan Breemen, RBPetukhov, PA Design, synthesis, modeling, biological evaluation and photoaffinity labeling studies of novel series of photoreactive benzamide probes for histone deacetylase 2. Bioorg Med Chem Lett22:5025-30 (2012) 
 
Histone deacetylase 2
Name:Histone deacetylase 2
Type:Chromatin regulator; hydrolase; repressor
Mol. Mass.:55356.54
Organism:Homo sapiens (Human)
Description:Q92769
Residue:488
BDBM50387970
NameBDBM50387970
Synonyms:CHEMBL2057827
TypeSmall organic molecule
Emp. Form.C21H18N8O2
Mol. Mass.414.42
SMILESNc1ccc(cc1NC(=O)c1ccc(OCCN=[N+]=[N-])c(c1)N=[N+]=[N-])-c1ccccc1