Reaction Details
TargetHistone deacetylase 2
LigandBDBM50232053
Substrate/Competitorn/a
Meas. Tech.ChEMBL_829148 (CHEMBL2059970)
IC50 140±n/a nM
Citation Vaidya, ASKarumudi, BMendonca, EMadriaga, AAbdelkarim, Hvan Breemen, RBPetukhov, PA Design, synthesis, modeling, biological evaluation and photoaffinity labeling studies of novel series of photoreactive benzamide probes for histone deacetylase 2. Bioorg Med Chem Lett22:5025-30 (2012) 
 
Histone deacetylase 2
Name:Histone deacetylase 2
Type:Chromatin regulator; hydrolase; repressor
Mol. Mass.:55356.54
Organism:Homo sapiens (Human)
Description:Q92769
Residue:488
BDBM50232053
NameBDBM50232053
Synonyms:CHEMBL271741 N-(4-aminobiphenyl-3-yl)benzamide
TypeSmall organic molecule
Emp. Form.C19H16N2O
Mol. Mass.288.3431
SMILESNc1ccc(cc1NC(=O)c1ccccc1)-c1ccccc1