Reaction Details
TargetPeptidyl-prolyl cis-trans isomerase FKBP1A
LigandBDBM50388288
Substrate/Competitorn/a
Meas. Tech.ChEMBL_829708 (CHEMBL2061148)
IC50 670±n/a nM
Citation Gopalakrishnan, RKozany, CWang, YSchneider, SHoogeland, BBracher, AHausch, F Exploration of pipecolate sulfonamides as binders of the FK506-binding proteins 51 and 52. J Med Chem55:4123-31 (2012) 
 
Peptidyl-prolyl cis-trans isomerase FKBP1A
Name:Peptidyl-prolyl cis-trans isomerase FKBP1A
Type:Isomerase
Mol. Mass.:11953.09
Organism:Homo sapiens (Human)
Description:P62942
Residue:108
BDBM50388288
NameBDBM50388288
Synonyms:CHEMBL2058494
TypeSmall organic molecule
Emp. Form.C31H33Cl2NO10S
Mol. Mass.682.565
SMILESCOc1ccc(CC[C@@H](OC(=O)[C@@H]2CCCCN2S(=O)(=O)c2cc(Cl)c(O)c(Cl)c2)c2cccc(OCC(O)=O)c2)cc1OC